[scribus] Cannot run the Fedora 29 version or the AppImage

Doug Hutcheson owlbrudder at gmail.com
Wed Dec 5 02:01:14 UTC 2018

On Wed, 2018-12-05 at 10:55 +1000, Doug Hutcheson wrote:
> Hi Doug,
> I have compiled and run 1.5.5svn on Fedora 29 without problems, so
> maybe you could try that?
> Greg
> Thanks Greg, but I cannot locate the source bundle - all Google can
> find are the nightly snapshots for Windows and Mac. Could you point
> me in the right direction please?
> Cheers, Doug

I found the instructions at 
- halfway down the page. Followed the instructions and the build failed
at the link stage again:
[ 76%] Linking CXX executable scribus/usr/bin/ld:
/usr/local/lib/libpodofo.a(PdfFontConfigWrapper.cpp.o): undefined
reference to symbol
//usr/lib64/libpthread.so.0: error adding symbols: DSO missing from
command linecollect2: error: ld returned 1 exit statusmake[2]: ***
[scribus/CMakeFiles/scribus.dir/build.make:13860: scribus/scribus]
Error 1make[1]: *** [CMakeFiles/Makefile2:158:
scribus/CMakeFiles/scribus.dir/all] Error 2make: *** [Makefile:152:
all] Error 2[doug at womble build]$ 
SO, one step forward in that I am trying to compile 1.5.5, but still no
cigar. Any ideas anyone?Cheers, Doug
-------------- next part --------------
An HTML attachment was scrubbed...
URL: <http://lists.scribus.net/pipermail/scribus/attachments/20181205/45b3790c/attachment.html>

More information about the scribus mailing list