[scribus] failed build on 64-bit Fedora 12

Gregory Pittman gregp_ky at yahoo.com
Sat Feb 6 19:09:44 CET 2010

My attempt at building quit in the middle with the following 

[ 57%] Building CXX object scribus/CMakeFiles/scribus.dir/pdflib.o
In file included from 
from /home/gregp/development/scribus133x/scribus/scribusstructs.h:25,
from /home/gregp/development/scribus133x/scribus/pdflib.h:45,
from /home/gregp/development/scribus133x/scribus/pdflib.cpp:25:
/usr/lib64/qt-3.3/include/qimage.h: In member function ‘bool 
QImageTextKeyLang::operator<(const QImageTextKeyLang&) const’:
/usr/lib64/qt-3.3/include/qimage.h:61: warning: suggest parentheses 
around ‘&&’ within ‘||’
/home/gregp/development/scribus133x/scribus/pdflib.cpp: In member 
function ‘void PDFlib::PDF_Error(const QString&)’:
/home/gregp/development/scribus133x/scribus/pdflib.cpp:6150: error: 
expected ‘;’ before string constant
/home/gregp/development/scribus133x/scribus/pdflib.cpp:6150: warning: 
statement is a reference, not call, to function ‘qDebug’
/home/gregp/development/scribus133x/scribus/pdflib.cpp:6150: warning: 
statement has no effect
make[2]: *** [scribus/CMakeFiles/scribus.dir/pdflib.o] Error 1
make[1]: *** [scribus/CMakeFiles/scribus.dir/all] Error 2
make: *** [all] Error 2

Anyone know what this means or how to fix it? Apparently something on 
line 6150, but doesn't help me much.


More information about the scribus mailing list