[Scribus] Error with make - CVS

Owen Cook rcook
Thu Dec 15 11:09:45 CET 2005

On Thu, 15 Dec 2005, Eilert wrote:

> Hi,
> In September, I got the cvs version, everything ok.
> Now I wanted to get the latest version, and when doing "make" I got this 
> error. Make stopped, but I thought it might run anyway, so I started 
> "make install". After a while this stopped too, saying again:
> docitemattrprefs.cpp:20:35: ./docitemattrprefs.ui.h: Datei oder 
> Verzeichnis nicht gefunden
> make[2]: *** [docitemattrprefs.o] Fehler 1
> make[2]: Leaving directory `/raid/home/tester/Scribus3cvs/Scribus/scribus'
> make[1]: *** [install-recursive] Fehler 1
> make[1]: Leaving directory `/raid/home/tester/Scribus3cvs/Scribus/scribus'
> make: *** [install-recursive] Fehler 1

I think

docitemattrprefs* are no longer used.

rm scribus/docitematt*

redo cvs

configure make and make install


More information about the scribus mailing list