[Scribus] error when compiling

Johannes Rüschel jo.rueschel
Mon Apr 5 17:52:34 CEST 2004


after updating to suse linux 9 i grabbed scribus again per cvs and at the end of compiling the following error is shown:

/usr/lib/gcc-lib/i586-suse-linux/3.3.1/../../../../i586-suse-linux/bin/ld: cannot find -lXcursor
collect2: ld returned 1 exit status
make[3]: *** [scribus] Fehler 1
make[3]: Leaving directory `/home/hannes/CVS/Scribus/scribus'
make[2]: *** [all-recursive] Fehler 1
make[2]: Leaving directory `/home/hannes/CVS/Scribus/scribus'
make[1]: *** [all-recursive] Fehler 1
make[1]: Leaving directory `/home/hannes/CVS/Scribus'
make: *** [all] Fehler 2
What can i do to solve this problem?

-------------- next part --------------
An HTML attachment was scrubbed...
URL: http://nashi.altmuehlnet.de/pipermail/scribus/attachments/20040405/a8be0044/attachment.html 

More information about the scribus mailing list