[Scribus] 1.1.0 build errors

Joe Villari joev_nylxs
Thu Sep 11 01:28:33 CEST 2003

Freetype 2.1.4 was installed for a scribus .9 build. I installed 
libart_lgpl-2.3.10-1 and libart_lgpl-devel-2.3.10-1 from RPMs without a 

First I ran ./configure for scribus-1.1.0 and got:

configure: error: You need at least libfreetype 5.0

Then I ran ./configure for scribus-scripting without any errors but 
during make I got:

cmdmisc.cpp: In function `struct PyObject * scribus_setredraw(PyObject 
*, PyObject *)':
cmdmisc.cpp:13: `class ScribusDoc' has no member named `DoDrawing'
make[2]: *** [cmdmisc.lo] Error 1
make[2]: Leaving directory `/home/joev/scribus-scripting-0.5.1/scriptplugin'
make[1]: *** [all-recursive] Error 1
make[1]: Leaving directory `/home/joev/scribus-scripting-0.5.1'
make: *** [all] Error 2

Where do I go from here?

I haven't had an error free first build since like version .7 or 
something like that.


More information about the scribus mailing list