[Scribus] compiling error :-(

Ralf Höling r.hoeling
Sun Nov 2 10:01:17 CET 2003

Since I have updated to Mac OS X 10.3 Panther it' not possible to 
compile scribus.
I use Apple X11 1.0, XCode, GCC 3.3, Fink Package manager version: 
Distribution version: 0.6.1.cvs.
Here is the error-code:

/usr/X11R6/lib/libfreetype.dylib(ftglyph.o) definition of _FT_Get_Glyph
ld: Undefined symbols:
make[3]: *** [scribus] Error 1
make[2]: *** [all-recursive] Error 1
make[1]: *** [all-recursive] Error 1
make: *** [all] Error 2
### execution of make failed, exit code 2
Failed: compiling scribus-1.1.1-12 failed

Any ideas?

Thanks in advance

-------------- next part --------------
A non-text attachment was scrubbed...
Name: not available
Type: text/enriched
Size: 612 bytes
Desc: not available
Url : http://nashi.altmuehlnet.de/pipermail/scribus/attachments/20031102/2ebd0def/attachment.bin 

More information about the scribus mailing list