[Scribus] cvs compile error...

Subash Jeyan nsjeyan
Thu Jun 19 16:19:19 CEST 2003


compiling the latest cvs throws up this error:

missing.cpp:65: prototype for `DmF::DmF(QWidget*, QString, preV*, bool)'
does not match any in class `DmF' 

missing.h:12: candidates are: DmF::DmF(const DmF&) 

missing.h:16:        	             DmF::DmF(QWidget*, QString, preV*)

missing.cpp: In constructor`DmF::DmF(QWidget*, QString, preV*, bool)':

missing.cpp:110:`PushButton2' undeclared (first use this function)

missing.cpp:110:(Each undeclared identifier is reported only once for
each function it appears in.) 

make[3]: *** [missing.o] Error 1 

make[3]: Leaving directory`/home/subash/Scribus/scribus' 

make[2]: *** [all-recursive] Error 1 

make[2]: Leaving directory `/home/subash/Scribus/scribus' 

make[1]: *** [all-recursive] Error 1
make[1]: Leaving directory `/home/subash/Scribus'
make: *** [all] Error 2

regards, subash.

More information about the scribus mailing list