[Scribus] Make Error

Joe Villari joev_nylxs
Mon Jun 16 23:07:25 CEST 2003


Here is the error I received while running make on

make[3]: Entering directory `/home/joev/scribus-'
source='scpreview.cpp' object='scpreview.o' libtool=no \
depfile='.deps/scpreview.Po' tmpdepfile='.deps/scpreview.TPo' \
depmode=gcc /bin/sh ../admin/depcomp \
g++ -DHAVE_CONFIG_H -I. -I. -I.. -I/usr/local/include 
-I/usr/local/include/freetype2 -I/usr/lib/qt3-gcc2.95/include 
-I/usr/X11R6/include  -DQT_THREAD_SUPPORT  -D_REENTRANT  -O2 
-fno-exceptions -fno-check-new  -c -o scpreview.o `test -f 
'scpreview.cpp' || echo './'`scpreview.cpp
scpreview.cpp: In method `class QPixmap ScPreview::createPreview(QString)':
scpreview.cpp:118: no matching function for call to 
`QValueVector<singleLine>::append (singleLine &)'
make[3]: *** [scpreview.o] Error 1
make[3]: Leaving directory `/home/joev/scribus-'
make[2]: *** [all-recursive] Error 1
make[2]: Leaving directory `/home/joev/scribus-'
make[1]: *** [all-recursive] Error 1
make[1]: Leaving directory `/home/joev/scribus-'
make: *** [all] Error 2


More information about the scribus mailing list