[Scribus] compile error???

Jack A. Krueger jkrueger
Wed Apr 2 18:38:10 CEST 2003

I've not been able to build Scribus since 9.4
Anybody get what I'm not doing OK?
I'm using SuSE8.
Thanks, Jack

Making all in libpdf
make[3]: Entering directory `/home/jkrueger/scribus-0.9.8/scribus/libpdf'
source='pdflib.cpp' object='pdflib.lo' libtool=yes \
depfile='.deps/pdflib.Plo' tmpdepfile='.deps/pdflib.TPlo' \
depmode=gcc /bin/sh ../../admin/depcomp \
/bin/sh ../../libtool --mode=compile --tag=CXX g++ -DHAVE_CONFIG_H -I. -I.
-I../.. -I/usr/lib/qt3/include -I/usr/X11R6/include -I../../scribus
-DQT_THREAD_SUPPORT  -D_REENTRANT  -O2 -fno-exceptions -fno-check-new  -c
-o pdflib.lo `test -f 'pdflib.cpp' || echo './'`pdflib.cpp
g++ -DHAVE_CONFIG_H -I. -I. -I../.. -I/usr/lib/qt3/include
-I/usr/X11R6/include -I../../scribus -DQT_THREAD_SUPPORT -D_REENTRANT -O2
-fno-exceptions -fno-check-new -c pdflib.cpp -Wp,-MD,.deps/pdflib.TPlo
-fPIC -DPIC -o .libs/pdflib.o
g++: Internal compiler error: program cc1plus got fatal signal 9
make[3]: *** [pdflib.lo] Error 1
make[3]: Leaving directory `/home/jkrueger/scribus-0.9.8/scribus/libpdf'
make[2]: *** [all-recursive] Error 1
make[2]: Leaving directory `/home/jkrueger/scribus-0.9.8/scribus'
make[1]: *** [all-recursive] Error 1
make[1]: Leaving directory `/home/jkrueger/scribus-0.9.8'
make: *** [all] Error 2

Jack A. Krueger
19 So. 5th Street
Reading, PA  19602
Voice 610-372-4572
jkrueger at sdf.lonestar.org

More information about the scribus mailing list