[Scribus] installing trouble on FC4

Gregory Pittman gpittman
Sun Jul 10 04:31:59 CEST 2005

PLinnell wrote:

>On Saturday 09 July 2005 17:59, Gregory Pittman wrote:
>>Just failed to be able to install 1.3cvs after what seemed like a
>>successful compile.
>Try it now, but be sure to rerun make -f Makefile.cvs and 
>re-run ./configure to ensure the makefiles are refreshed.
>Sorry for the troubles.. I am doing a massive update to the docs in 
>the 1.3 tree.
Perhaps cascading problems -- first got the 'cannot find 
applytemplatedialog.cpp' problem even after make clean, so I created a 
new Scribus directory from CVS.  That compiled Ok, now I fail install again:

/usr/bin/install: cannot stat `./install4.html': No such file or directory
make[5]: *** [install-data-local] Error 1
make[5]: Leaving directory `/home/gregp/development/Scribus/scribus/doc/en'
make[4]: *** [install-am] Error 2
make[4]: Leaving directory `/home/gregp/development/Scribus/scribus/doc/en'
make[3]: *** [install-recursive] Error 1
make[3]: Leaving directory `/home/gregp/development/Scribus/scribus/doc/en'
make[2]: *** [install-recursive] Error 1
make[2]: Leaving directory `/home/gregp/development/Scribus/scribus/doc'
make[1]: *** [install-recursive] Error 1
make[1]: Leaving directory `/home/gregp/development/Scribus/scribus'
make: *** [install-recursive] Error 1


More information about the scribus mailing list