[Scribus] installing trouble on FC4

Gregory Pittman gpittman
Sat Jul 9 17:59:06 CEST 2005

Just failed to be able to install 1.3cvs after what seemed like a 
successful compile.
/usr/bin/install -c -p -m 644 ./acro2.png 
/usr/bin/install: cannot stat `./acro2.png': No such file or directory
make[5]: *** [install-data-local] Error 1
make[5]: Leaving directory 
make[4]: *** [install-am] Error 2
make[4]: Leaving directory 
make[3]: *** [install-recursive] Error 1
make[3]: Leaving directory `/home/gregp/development/Scribus/scribus/doc/en'
make[2]: *** [install-recursive] Error 1
make[2]: Leaving directory `/home/gregp/development/Scribus/scribus/doc'
make[1]: *** [install-recursive] Error 1
make[1]: Leaving directory `/home/gregp/development/Scribus/scribus'
make: *** [install-recursive] Error 1


More information about the scribus mailing list