[Scribus] Make error Spet.30

Tom2 tjakabfy
Thu Sep 30 21:02:30 CEST 2004

I compiled Scribus CVS last week with no errors, but today. I get this:
mkdir .libs
g++ -DHAVE_CONFIG_H -I. -I. -I../../.. -I/usr/include/freetype2 
-I/usr/lib/qt3//                              include 
-I/usr/X11R6/include -I../../../scribus -I/usr/include/python2.3 
-DQT_TH                              READ_SUPPORT -D_REENTRANT -O2 
-fno-exceptions -fno-check-new -MT 
valuedialog.lo                               -MD -MP -MF 
.deps/valuedialog.Tpo -c valuedialog.cpp  -fPIC -DPIC -o 
.libs/value                              dialog.o
valuedialog.cpp: In constructor `ValueDialog::ValueDialog(QWidget*, 
const char*,                               bool, unsigned int)':
valuedialog.cpp:17: error: `setModal' undeclared (first use this function)
valuedialog.cpp:17: error: (Each undeclared identifier is reported only 
once for                               each function it appears in.)
make[5]: *** [valuedialog.lo] Error 1
make[5]: Leaving directory 
make[4]: *** [all-recursive] Error 1
make[4]: Leaving directory 
make[3]: *** [all-recursive] Error 1
make[3]: Leaving directory `/home/tom/CVS/Scribus/scribus/plugins'
make[2]: *** [all-recursive] Error 1
make[2]: Leaving directory `/home/tom/CVS/Scribus/scribus'
make[1]: *** [all-recursive] Error 1
make[1]: Leaving directory `/home/tom/CVS/Scribus'
make: *** [all] Error 2
Any help is appreciated


More information about the scribus mailing list