[Scribus] compiling problem

Bojan Božović bole89
Wed Oct 27 15:56:44 CEST 2004

	I just downloaded the latest version from CVS and tried to compile it 
but half way through I received the following error:

if g++ -DHAVE_CONFIG_H -I. -I. -I.. -I/usr/include/libart-2.0 
-I/usr/include/freetype2 -I/usr/lib/qt3//include -I/usr/X11R6/include 
-DQT_THREAD_SUPPORT  -D_REENTRANT  -O2 -fno-exceptions -fno-check-new 
-MT pdfopts.o -MD -MP -MF ".deps/pdfopts.Tpo" -c -o pdfopts.o pdfopts.cpp; \
then mv -f ".deps/pdfopts.Tpo" ".deps/pdfopts.Po"; else rm -f 
".deps/pdfopts.Tpo"; exit 1; fi
In file included from pdfopts.cpp:2:
pdfopts.moc: In member function `virtual bool PDF_Opts::qt_invoke(int, 
pdfopts.moc:182: error: `PDFMirrorH' undeclared (first use this function)
pdfopts.moc:182: error: (Each undeclared identifier is reported only 
once for each function it appears in.)
make[3]: *** [pdfopts.o] Error 1
make[3]: Leaving directory 
make[2]: *** [all-recursive] Error 1
make[2]: Leaving directory 
make[1]: *** [all-recursive] Error 1
make[1]: Leaving directory `/home/bojan/svashta/scribus_prevod/Scribus'
make: *** [all] Error 2

	What should I do to fix this?



 >>Think Linux<<	

More information about the scribus mailing list