[Scribus] ni keneng bang zhu wo?

Servants servants
Sat Jun 12 07:57:27 CEST 2004

I can't compile Scribus anymore.  I sent a previous error message 
while trying the cvs route.  Now I've tried compiling 
scribus-1.1.7.tar.bz2 and it didn't work either.  I moved drives in 
my comp, so I've had to reinstall Slack, but was using cvs with no 
problems before.

When it gets to the part where this first line below starts, it halts 
for about 5 seconds, then finishes with this.  Here's my errors:

g++ -DHAVE_CONFIG_H -I. -I. -I.. -I/usr/include/libart-2.0 -I/usr/
include/freetype2 -I/usr/lib/qt-3.2.1/include -I.  
-DQT_THREAD_SUPPORT  -D_REENTRANT  -O2 -fno-exceptions -fno-check-new  
-c -o scribusview.o `test -f 'scribusview.cpp' || echo 
scribusview.cpp: In member function `void 
   PageItem*, double, double)':
scribusview.cpp:2206: `pow' undeclared (first use this function)
scribusview.cpp:2206: (Each undeclared identifier is reported only 
once for 
   each function it appears in.)
scribusview.cpp:2206: `sqrt' undeclared (first use this function)
scribusview.cpp:2236: `atan2' undeclared (first use this function)
make[2]: *** [scribusview.o] Error 1
make[2]: Leaving directory `/usr/src/scribus-1.1.7/scribus'
make[1]: *** [install-recursive] Error 1
make[1]: Leaving directory `/usr/src/scribus-1.1.7/scribus'
make: *** [install-recursive] Error 1

****  Installation failed. Aborting package creation.

Restoring overwritten files from backup...OK

Cleaning up...OK



More information about the scribus mailing list