[Scribus] Problems with 1.1.2. compiling

Kurt Lhotzky kurt.lhotzky
Mon Nov 3 11:18:37 CET 2003

I must admit, that I am rather clumsy "user" and not really familiar
with Linux. I am at present running Scribus 1.1.1 and like it very much.
Now I tried to install 1.1.2 under SuSE 8.2 and got the following error
message - can anyone tell me how to procede?

Many thanks,

Kurt Lhotzky 

In file included from cmdutil.cpp:1:
cmdutil.h:4:20: Python.h: No such file or directory
make[4]: *** [cmdutil.lo] Fehler 1
make[4]: Leaving directory
make[3]: *** [install-recursive] Fehler 1
make[3]: Leaving directory
make[2]: *** [install-recursive] Fehler 1
make[2]: Leaving directory
make[1]: *** [install-recursive] Fehler 1
make[1]: Leaving directory `/home/Borris/dtp/scribus-1.1.2/scribus'
make: *** [install-recursive] Fehler 1

More information about the scribus mailing list