[Scribus] Erro when compiling

Marjan Andonovski huma
Wed Jun 18 19:56:06 CEST 2003

This is error which I receive when I try to compile Scribus. What do I
I'm compiling Scribus on SuSE 8.0.

Making all in plugins
make[3]: Entering directory `/razmena/scribus-'
Making all in libchar
make[4]: Entering directory `/razmena/scribus-'
/usr/lib/qt3/bin/moc ./charselect.h -o charselect.moc
source='charselect.cpp' object='charselect.lo' libtool=yes \
depfile='.deps/charselect.Plo' tmpdepfile='.deps/charselect.TPlo' \
depmode=gcc /bin/sh ../../../admin/depcomp \
/bin/sh ../../../libtool --mode=compile --tag=CXX g++ -DHAVE_CONFIG_H -I. -I. -I../../.. -I/usr/include/freetype2 -I/usr/lib/qt3/include -I/usr/X11R6/include -I../../../scribus -DQT_THREAD_SUPPORT  -D_REENTRANT  -O2 -fno-exceptions -fno-check-new  -c -o charselect.lo `test -f 'charselect.cpp' || echo './'`charselect.cpp
mkdir .libs
g++ -DHAVE_CONFIG_H -I. -I. -I../../.. -I/usr/include/freetype2 -I/usr/lib/qt3/include -I/usr/X11R6/include -I../../../scribus -DQT_THREAD_SUPPORT -D_REENTRANT -O2 -fno-exceptions -fno-check-new -c charselect.cpp -Wp,-MD,.deps/charselect.TPlo  -fPIC -DPIC -o .libs/charselect.o
charselect.cpp: In method `ZAuswahl::ZAuswahl(QWidget *, preV *, PageItem *, ScribusApp *)':
charselect.cpp:71: implicit declaration of function `int FT_Get_First_Char(...)'
charselect.cpp:76: implicit declaration of function `int FT_Get_Next_Char(...)'
make[4]: *** [charselect.lo] Error 1
make[4]: Leaving directory `/razmena/scribus-'
make[3]: *** [all-recursive] Error 1
make[3]: Leaving directory `/razmena/scribus-'
make[2]: *** [all-recursive] Error 1
make[2]: Leaving directory `/razmena/scribus-'
make[1]: *** [all-recursive] Error 1
make[1]: Leaving directory `/razmena/scribus-'
make: *** [all] Error 2
Best regards,
 Marjan                          mailto:marjan at deltayu.com
Best regards,
 Marjan                          mailto:huma at beotel.yu

More information about the scribus mailing list