[Scribus] New compilation erros whit last tarball

manxopar manxopar
Wed Jun 18 21:32:19 CEST 2003


I have a new compilation error in last tarball (9.11.1) in Mandrake 9.0

/usr/lib/qt3/bin/moc ./scribusXml.h -o scribusXml.moc
if g++ -DHAVE_CONFIG_H -I. -I. -I.. -I/usr/include/freetype2 -I/usr/lib/qt3/include -I/usr/X11R6/include  -DQT_THREAD_SUPPORT  -D_REENTRANT  -O2 -fno-exceptions -fno-check-new  -MT scribusXml.o -MD -MP -MF ".deps/scribusXml.Tpo" \
          -c -o scribusXml.o `test -f 'scribusXml.cpp' || echo './'`scribusXml.cpp; \
        then mv ".deps/scribusXml.Tpo" ".deps/scribusXml.Po"; \
        else rm -f ".deps/scribusXml.Tpo"; exit 1; \
scribusXml.cpp: In member function `QString ScriXmlDoc::WriteElem(QPtrList<PageItem>*, ScribusDoc*)':
scribusXml.cpp:1905: `Iterator' is not a member of type `QValueVector<singleLine>'
scribusXml.cpp:1905: parse error before `;' token
scribusXml.cpp:1906: `itMU2' undeclared (first use this function)
scribusXml.cpp:1906: (Each undeclared identifier is reported only once for each function it appears in.)
scribusXml.cpp: In member function `bool ScriXmlDoc::WriteDoc(QString, ScribusDoc*, ScribusView*, QProgressBar*)':
scribusXml.cpp:2280: `Iterator' is not a member of type `QValueVector<singleLine>'
scribusXml.cpp:2280: parse error before `;' token
make[3]: *** [scribusXml.o] Error 1
make[3]: Saliendo directorio `/trasteiro/scribus-'
make[2]: *** [all-recursive] Error 1
make[2]: Saliendo directorio `/trasteiro/scribus-'
make[1]: *** [all-recursive] Error 1
make[1]: Saliendo directorio `/trasteiro/scribus-'
make: *** [all] Error 2

A lot of thanks


More information about the scribus mailing list