[scribus-dev] Failure to build SVN 24243

Owen owen.cook at gmx.com
Sat Nov 14 06:07:54 UTC 2020

I wonder if anyone can help me resolve this error.

[ 84%] Building C object
scribus/CMakeFiles/scribus.dir/third_party/hyphen/hnjalloc.c.o [ 84%]
Building C object
scribus/CMakeFiles/scribus.dir/third_party/hyphen/hyphen.c.o [ 84%]
Building CXX object scribus/CMakeFiles/scribus.dir/main.cpp.o [ 84%]

Linking CXX executable scribus /usr/bin/ld:
text/libscribus_text_lib.a(textshaper.cpp.o): undefined reference to
symbol 'ubidi_open_66' /usr/bin/ld:
/lib/x86_64-linux-gnu/libicuuc.so.66: error adding symbols: DSO missing
from command line collect2: error: ld returned 1 exit status make[2]:
*** [scribus/CMakeFiles/scribus.dir/build.make:14169: scribus/scribus]
Error 1 make[1]: *** [CMakeFiles/Makefile2:2403:
scribus/CMakeFiles/scribus.dir/all] Error 2 make: *** [Makefile:152:
all] Error 2

Google has a number of entries for "DSO missing ..." but I can't relate
them to my problem.

make was run with -j4, so then tried it without the "j" option and it
failed at 74% with the same error.

cmake output https://termbin.com/qdih shows all seems to be in order



More information about the scribus-dev mailing list