[scribus-dev] Compiling failed

Listen listen at thomas-zastrow.de
Sat May 25 14:28:30 UTC 2013

Dear all,

Compiling the actual SVN checkout on Fedora 17 failed:

Linking CXX executable scribus
/usr/bin/ld: CMakeFiles/scribus.dir/ui/moc_AdapterWidget.cxx.o: 
undefined reference to symbol '_ZN11OpenThreads6AtomicmmEv'
/usr/bin/ld: note: '_ZN11OpenThreads6AtomicmmEv' is defined in DSO 
/lib/libOpenThreads.so.12 so try adding it to the linker command line
/lib/libOpenThreads.so.12: could not read symbols: Invalid operation
collect2: error: ld returned 1 exit status
make[2]: *** [scribus/scribus] Error 1
make[1]: *** [scribus/CMakeFiles/scribus.dir/all] Error 2
make: *** [all] Error 2

Any ideas?



More information about the scribus-dev mailing list